﻿businessName,contactName,email,category,street,city,state,postal,phoneNumber,webSite,contactUrl,facebook,twit,linkdn,url
TOUCH OF ELEGANCE FURNITURE,IBIN IRIZARRY,info@touchofelegancefurniture.com,Furniture & Accessories,,Freehold,New Jersey,7728,,http://touchofelegancefurniture.com,http://touchofelegancefurniture.com/contactus,http://facebook.com/touchofelegancefurniture,http://twitter.com/touchofelegancefurniture,,http://www.houzz.com/pro/toefurniture/touch-of-elegance-furniture
Tualatin Valley Glass,,sales@tualatinvalleyglass.com,Windows,,Tigard,Oregon,97223,(503) 639-4304,http://www.tualatinvalleyglass.com/,http://www.tualatinvalleyglass.com/,,,,http://www.houzz.com/pro/tualatinvalleyglass1/tualatin-valley-glass
Janice's at the Saltbox,,andra@janicesatthesaltbox.com,Interior Designers & Decorators,,Lexington,Kentucky,40502,(859) 266-2300,http://www.janicesatthesaltbox.com/contact.html,http://www.janicesatthesaltbox.com/contact.html/contact.html,,,,http://www.houzz.com/pro/ice22snow/janices-at-the-saltbox
martinson construction,,davem@martinsonconstruction.com,"Tile, Stone & Countertops",,Waterloo,Iowa,,,http://www.martinsonconstruction.com/,http://www.martinsonconstruction.com/CONTACT.HTM,,,,http://www.houzz.com/pro/smartinson/martinson-construction
wuhackerz,,wubugs58@gmail.com,Appliances,,newyork,New York,,(518) 474-3862,http://www.wubugz.net,http://www.wubugz.net/mailto:wubugs58@gmail.com,,,,http://www.houzz.com/pro/wu-hackerz/wuhackerz
Peerless Concrete Products Co,"Clara Monaco, President",sales@peerlessconcrete.com,Building Supplies,246 Main St,Butler,New Jersey,7405,(973) 838-3060,http://PEERLESSCONCRETE.COM,http://peerlessconcrete.com/contact-us.html,https://www.facebook.com/pages/Peerless-Concrete-Products/535456789819463,,,http://www.houzz.com/pro2/peerlessconcreteproductsco0zzszy/peerless-concrete-products-co
Thermal Controls Corp,"Van Frittle, President",office@thermalcontrols.net,Appliances,104 Pastor Anderson Way,Greensboro,North Carolina,27401,(336) 272-4508,http://THERMALCONTROLS.NET,http://thermalcontrols.net/,,,,http://www.houzz.com/pro2/thermalcontrolscorp/thermal-controls-corp
RIMA Projects,Rich,info@rimaprojects.com,General Contractors,,Houston,Texas,77098,(713) 429-5578,http://www.rimaprojects.com/,http://www.rimaprojects.com/contact/,,,,http://www.houzz.com/pro/rimaprojects/rima-projects
WASHTENAW DOOR & TRIM INC,"Laura Spear, Owner",info@washtenawdoor.com,Door Sales & Installation,2502 E Michigan Ave,Ypsilanti,Michigan,48198,(734) 256-4138,http://WASHTENAWDOOR.COM,http://washtenawdoor.com/,,,,http://www.houzz.com/pro2/washtenawdoortriminc103y2c/washtenaw-door-trim-inc
Square Root Collection,,info@squarerootcollection.com,Furniture & Accessories,,CHICAGO,Illinois,,(312) 625-2168,http://squarerootcollection.com,http://squarerootcollection.com/Contact.html,https://www.facebook.com/squarerootcollection,,,http://www.houzz.com/pro/squarerootcollection/square-root-collection
Lance Putnam,,putnamlandscape@gmail.com,Landscape Contractors,,Kansas City,Missouri,64131,(816) 825-1148,http://www.putnamlandscape.com/,http://www.putnamlandscape.com/contact.html,https://www.facebook.com/PutnamLandscape,,,http://www.houzz.com/pro/putnamlandscape/lance-putnam
Eagle Fence Inc,"Rick Bachmann, Owner",eaglefence@aol.com,Fencing & Gate Sales & Construction,5899 Mahoning Ave NW,Warren,Ohio,44483,(330) 847-7430,http://EAGLEFENCE.COM,http://eaglefence.com/contact_us.html,,,,http://www.houzz.com/pro2/eaglefenceinc1txh68/eagle-fence-inc
Oak Home Builders Co,Oliver Kiesel,Oliver@oakhomes.com,Home Builders,13960 Hiwasse Rd.,Hiwasse,Arkansas,72739,,http://www.oakhomes.com/,http://www.oakhomes.com/contactus.php,,,,http://www.houzz.com/pro/oliver-kiesel/oak-home-builders-co
Marlin Design Build,B S,samantha@marlindesignbuild.com,General Contractors,206 Preston Oaks Ln,Cary,North Carolina,27513,,http://www.marlindesignbuild.com,http://www.marlindesignbuild.com/#ContactUs-1ContactUs,,,,http://www.houzz.com/pro/marlindesignbuild/marlin-design-build
Heather Wells,Heather Wells,info@heatherwells.com,Interior Designers & Decorators,"359 Boylston Street, Suite 2",Boston,Massachusetts,2116,(617) 437-7077,http://heatherwells.com,http://heatherwells.com/contact,https://www.facebook.com/HeatherWellsInc,https://twitter.com/HeatherWellsInc,,http://www.houzz.com/pro/heatherwellsinteriors/heather-wells
Powerbuilders,n Albertini,info@powerbuilders.com,Interior Designers & Decorators,,Dallas,Texas,75240,(214) 252-7227,http://www.powerbuilders.com,http://www.powerbuilders.com/,,,,http://www.houzz.com/pro/nalbertini/powerbuilders
Brennan Pools Inc,"Tim Brennan, Owner",info@brennanpools.com,Swimming Pool Builders,651 West St,Southington,Connecticut,6489,(860) 628-6669,http://BRENNANPOOLS.COM,http://brennanpools.com/contact_us,http://facebook.com/brennanpools,,,http://www.houzz.com/pro2/brennanpoolsinc/brennan-pools-inc
A-1 HIDDEN DOG FENCE,,sales@hiddenfence.com,Fencing & Gate Sales & Construction,304 State Highway 10,Bridgewater,New Jersey,8807,(908) 203-1123,http://www.hiddenfence.com,http://www.hiddenfence.com/contact-us/,https://www.facebook.com/HiddenFence,,,http://www.houzz.com/pro2/a1hiddendogfence141388/a-1-hidden-dog-fence
Forrest Fireplaces,Roberto Sanchez,forrestu1@aol.com,Fireplace Sales & Installation,200 A Se 8th St,Moore,Oklahoma,73160,(405) 912-4450,http://forrestfireplaces.com,http://forrestfireplaces.com/contact-us.html,,,,http://www.houzz.com/pro2/forrestfireplaces6e0425f/forrest-fireplaces
Advanced Energy Systems LLC,,info@solar-aes.com,Solar Energy Contractors,NABCEP PV,Scottsdale,Arizona,85260,,http://www.solar-aes.com/,http://www.solar-aes.com/mailto:info@solar-aes.com?subject=Request for Information,,,,http://www.houzz.com/pro2/advancedenergysystemsllc04f3a7c/advanced-energy-systems-llc
