Initial,Surname,Street,Suburb,Search State,Code,Phone1,Phone2,Phone3,Mobile1,Mobile2,Email,IP,SOURCE
J,Hayley,6 Lenamont Ct,Dunsborough,WA,6281,,,,0419 189 244,,jhas161yley@yahoo.com,143.32.161.240,http://iphoned.org/
J,Hayley,18 Carter St,Busselton,WA,6280,,,,0448 813 442,,jhat_yley@hotmail.co.au,165.22.210.135,http://iphoned.org/
J,Hayley,6 Court St,West Busselton,WA,6280,,,,0419 841 143,,jhau161yley@gmail.com,192.243.161.179,http://iphoned.org/
K,Hayley,23 Peppermint,Ballajura,WA,6066,,,,0433 857 977,,khav_yley@hotmail.au,203.165.105.229,http://www.engadget.com/2014/03/11/engadget-giveaway-win-an-iphone-5s/
D,Haylock,16 Atlantic Ave,Iluka,WA,6028,08 9304 2880,,,0433 604 274,,dhax147ylock@yahoo.com,60.170.147.234,http://www.engadget.com/2014/03/11/engadget-giveaway-win-an-iphone-5s/
E,Hayman,289 Sydney Rd,Wanneroo,WA,6065,08 9306 5517,,,0419 047 213,,ehas150yman@hotmail.com,143.188.150.60,www.winnow.com.au
R,Hayman,36 Buckingham Rd,Kelmscott,WA,6111,08 9390 9658,,,0417 990 061,,rhab133yman@yahoo.com,120.97.133.79,http://www.winiphone5.net/
M,Hayman,25 Brabant Way,Hamersley,WA,6022,,,,0438 997 034,,mhab132yman@hotmail.co.au,120.165.132.92,http://www.engadget.com/2014/03/11/engadget-giveaway-win-an-iphone-5s/
N,Hayman,83 Coolamon,Ellenbrook,WA,6069,,,,0430 356 558,,nhac1yman@gmail.com,121.0.1.5,http://www.engadget.com/2014/03/11/engadget-giveaway-win-an-iphone-5s/
P,Hayman,3 Malu Ct,Westfield,WA,6111,,,,0488 196 226,,phad249yman@hotmail.au,138.191.249.200,http://www.engadget.com/2014/03/11/engadget-giveaway-win-an-iphone-5s/
R,Hayman,42 Mariners Vw,Mindarie,WA,6030,,,,0419 911 683,,rhae120yman@hotmail.co.au,139.165.120.207,http://www.engadget.com/2014/03/11/engadget-giveaway-win-an-iphone-5s/
R,Hayman,1 Kalanni East Rd,Dalwallinu,WA,6609,,,,0447 083 928,,rhaf81yman@yahoo.com,143.1.81.81,http://www.win-free-stuff.com.au/
S,Haymes,10 Nethercott St,Huntingdale,WA,6110,,,,0430 222 285,,shaq225ymes@hotmail.com,138.179.225.176,www.winnow.com.au
J,Haymes-Holder,8 Debernales St,Kalgoorlie,WA,6430,,,,0417 790 969,,jhar12ymes-holder@live.au,139.16.12.176,http://www.competitioncrazy.com/au/prize/free-iphone/
R,Haynes,33a Whitfeld St,Floreat,WA,6014,08 9387 1647,,,0402 817 948,,rhak128ynes@msn.com,60.63.128.111,http://www.engadget.com/2014/03/11/engadget-giveaway-win-an-iphone-5s/
P,Haynes,1 Dolium Crt,Heathridge,WA,6027,08 9403 7862,,,0412 747 015,,phaz92ynes@hotmail.au,101.245.92.86,http://www.win-free-stuff.com.au/
A,Haynes,20 Jeffries St,Mt Melville,WA,6330,,,,0447 426 125,,ahaz173ynes@hotmail.co.au,101.102.173.154,http://iphoned.org/
B,Haynes,266 French St,Tuart Hill,WA,6060,,,,0407 766 652,,bhaa188ynes@gmail.com,110.244.188.249,http://iphoned.org/
D,Haynes,7 Glenbrook Dr,Ballajura,WA,6066,,,,0433 151 477,,dhab_ynes@hotmail.au,120.117.107.47,http://www.engadget.com/2014/03/11/engadget-giveaway-win-an-iphone-5s/
D,Haynes,39 Hamersley St,Broome,WA,6725,,,,0418 938 030,,dhac120ynes@hotmail.co.au,121.82.120.80,http://www.engadget.com/2014/03/11/engadget-giveaway-win-an-iphone-5s/
M,Haynes,13 Albert St,Little Grove,WA,6330,,,,0418 946 453,,mhad9ynes@yahoo.com,138.62.9.56,http://www.engadget.com/2014/03/11/engadget-giveaway-win-an-iphone-5s/
M,Haynes,44 Darley Cir,Bull Creek,WA,6149,,,,0419 952 289,,mhae172ynes@hotmail.com,139.247.172.45,http://www.engadget.com/2014/03/11/engadget-giveaway-win-an-iphone-5s/
J,Haynes,111 Kastrel Pl,Kununurra,WA,6743,,,,0439 576 736,,jhaf238ynes@gmail.com,143.8.238.203,http://www.engadget.com/2014/03/11/engadget-giveaway-win-an-iphone-5s/
J,Haynes,111 Crystal Pl,Kununurra,WA,6743,,,,0419 908 989,,jhag114ynes@msn.com,165.28.114.91,http://www.engadget.com/2014/03/11/engadget-giveaway-win-an-iphone-5s/
J,Haynes,Lot 7 Rich Pl,Dardanup,WA,6236,,,,0417 933 921,,jhah89ynes@live.au,192.30.89.220,http://www.engadget.com/2014/03/11/engadget-giveaway-win-an-iphone-5s/
K,Haynes,7 Glenbrook Dr,Ballajura,WA,6066,,,,0433 382 460,,khai20ynes@bigpond.net.au,203.60.20.252,http://www.engadget.com/2014/03/11/engadget-giveaway-win-an-iphone-5s/
K,Haynes,16 Tuart St,Rangeway,WA,6530,,,,0448 366 144,,khaj239ynes@ektra.ac.th,58.49.239.157,http://www.engadget.com/2014/03/11/engadget-giveaway-win-an-iphone-5s/
K,Haynes,686 Beach Rd,Warwick,WA,6024,,,,0418 170 476,,khak113ynes@tassie.net.au,60.117.113.170,http://www.engadget.com/2014/03/11/engadget-giveaway-win-an-iphone-5s/
M,Haynes,7 Glenbrook Drv,Ballajura,WA,6066,,,,0417 097 486,,mhal227ynes@gmail.com,61.88.227.47,http://www.engadget.com/2014/03/11/engadget-giveaway-win-an-iphone-5s/
M,Haynes,7 Glenbrook Drv,Ballajura,WA,6066,,,,0409 685 304,,mham169ynes@gmail.com,211.51.169.71,http://www.engadget.com/2014/03/11/engadget-giveaway-win-an-iphone-5s/
M,Haynes,4 Hull St,Greenough,WA,6532,,,,0408 852 079,,mhan163ynes@yahoo.com,110.165.163.232,http://www.engadget.com/2014/03/11/engadget-giveaway-win-an-iphone-5s/
M,Haynes,30 San Marco Qys,Halls Head,WA,6210,,,,0400 330 004,,mhao216ynes@hotmail.com,120.254.216.52,http://www.engadget.com/2014/03/11/engadget-giveaway-win-an-iphone-5s/
N,Haynes,30 Daylesford Elb,Jane Brook,WA,6056,,,,0400 514 516,,nhap233ynes@live.au,121.15.233.76,http://www.win-free-stuff.com.au/
P,Haynes,6 Hawick Ct,Warwick,WA,6024,,,,0431 258 848,,phaq52ynes@live.au,138.231.52.82,http://www.win-free-stuff.com.au/
S,Haynes,408 Safety Bay Rd,Safety Bay,WA,6169,,,,0400 012 417,,shar187ynes@live.au,139.63.187.141,http://www.win-free-stuff.com.au/
S,Haynes,12 Hamlet Pass,Jane Brook,WA,6056,,,,0438 104 004,,shas30ynes@yahoo.com,143.133.30.173,www.kogan.com/au/competition
T,Haynes,3 Sandford Cres,Halls Head,WA,6210,,,,0438 505 851,,that117ynes@hotmail.co.au,165.3.117.123,www.kogan.com/au/competition
L,Hayres,141 Osmaston Rd,Carine,WA,6020,,,,0438 898 427,,lhai149yres@hotmail.com,203.211.149.199,http://contest.wishfree.com/iphone-contest/
A,Hays,2 Sherwood Crt,Perth,WA,6000,08 9325 8784,,,0427 258 784,,ahar121ys@yahoo.com,139.94.121.99,www.sureslim.com.au
C,Hays,14 Patterson St,Onslow,WA,6710,,,,0438 681 032,,chaj46ys@hotmail.au,58.240.46.86,http://www.engadget.com/2014/03/11/engadget-giveaway-win-an-iphone-5s/
R,Hays,78 Charolais Trl,Lower Chittering,WA,6084,,,,0429 944 726,,rhak194ys@hotmail.co.au,60.94.194.96,http://www.engadget.com/2014/03/11/engadget-giveaway-win-an-iphone-5s/
D,Hays,6 Park St,Northam,WA,6401,,,,0417 926 301,,dhal114ys@yahoo.com,61.3.114.62,http://www.win-free-stuff.com.au/
D,Hays,1 Yongaleena Comm,Wittenoom Gorge,WA,6752,,,,0447 092 859,,dham100ys@hotmail.com,211.32.100.242,http://www.win-free-stuff.com.au/
M,Haysey,11 Nutfield St,Bayswater,WA,6053,,,,0438 795 056,,mhar101ysey@ektra.ac.th,139.42.101.66,www.winiphone5.com.au
C,Haysom,2 Grevillea Av,Roleystone,WA,6111,,,,0447 135 806,,chaz236ysom@live.au,101.149.236.92,http://www.imore.com/win-new-iphone-5s-contest-comment-now-enter
G,Hayter,1 Gem Way,Dawesville,WA,6211,08 9582 3116,,,0417 176 002,,ghak16yter@hotmail.com,60.98.16.199,www.kogan.com/au/competition
B,Hayter,43 Nelley Way,Wickham,WA,6720,,,,0427 336 228,,bhas43yter@hotmail.co.au,143.111.43.131,www.winnow.com.au
B,Hayter,825 Beaufort St,Inglewood,WA,6052,,,,0433 599 427,,bhat31yter@yahoo.com,165.213.31.185,http://www.competitioncrazy.com/au/prize/free-iphone/
E,Hayter,6 Tanunda Rd,Coogee,WA,6166,,,,0418 948 011,,ehau178yter@hotmail.com,192.63.178.14,http://www.winiphone5.com.au/
G,Hayter,27 Beckley,Leeming,WA,6149,,,,0414 275 144,,ghav25yter@gmail.com,203.112.25.52,http://www.imore.com/win-new-iphone-5s-contest-comment-now-enter
G,Hayter,18 Haven Pl,Thornlie,WA,6108,,,,0408 094 189,,ghaw214yter@msn.com,58.53.214.20,http://winiphone5.org/
J,Hayter,6 Gorgon Pl,South Hedland,WA,6722,,,,0437 293 845,,jhax68yter@live.au,60.218.68.13,http://www.aussiecontests.com/signup1.php?s1=3&s2=8&pid=0&t1=&t2=&t3=
K,Hayter,1 Gem Way,Mandurah,WA,6210,,,,0400 219 987,,khay131yter@bigpond.net.au,61.67.131.215,http://iphoned.org/
M,Hayter,14 Kidson St,Kardinya,WA,6163,,,,0439 732 738,,mhaz253yter@ektra.ac.th,101.104.253.169,http://www.winiphone5.net/
P,Hayter,Emu Hill East Rd,Narembeen,WA,6369,,,,0429 647 600,,phaa208yter@tassie.net.au,110.117.208.226,http://contest.wishfree.com/iphone-contest/
T,Hayter,4 Neptune,Beldon,WA,6027,,,,0400 166 750,,thab252yter@gmail.com,120.115.252.237,www.freewego.com/iphone4s/?
J,Haythornthwaite,2062 Bulyee-Quairading Rd,Wamenusking,WA,6383,08 9645 4242,,,0427 454 244,,jhax87ythornthwaite@yahoo.com,60.248.87.94,http://www.engadget.com/2014/03/11/engadget-giveaway-win-an-iphone-5s/
J,Haythornthwaite,19 Wylam Rd,Collie,WA,6225,08 9734 3669,,,0458 636 679,,jhay_ythornthwaite@hotmail.com,61.225.201.128,http://www.engadget.com/2014/03/11/engadget-giveaway-win-an-iphone-5s/
E,Haythornthwaite,11 Wattle Bird Ct,Busselton,WA,6280,,,,0411 263 197,,ehab164ythornthwaite@live.au,110.99.164.174,http://www.engadget.com/2014/03/11/engadget-giveaway-win-an-iphone-5s/
R,Haythornthwaite,25 Kenmore Cres,Floreat,WA,6014,,,,0403 937 859,,rhac73ythornthwaite@yahoo.com,120.169.73.37,http://www.engadget.com/2014/03/11/engadget-giveaway-win-an-iphone-5s/
T,Haythornthwaite,6 Rhone Pl,Beechboro,WA,6063,,,,0438 984 830,,thad124ythornthwaite@hotmail.co.au,121.54.124.1,http://www.win-free-stuff.com.au/
M,Hayton,6 Cessna Drv,Jandakot,WA,6164,08 9414 1412,,,0448 796 665,,mhap129yton@gmail.com,120.150.129.102,http://www.competitioncrazy.com/au/prize/free-iphone/
A,Hayton,205 North Beach Dr,Tuart Hill,WA,6060,,,,0403 816 506,,ahay191yton@gmail.com,60.112.191.95,www.win-free-stuff.com.au/competitions/...by.../win-a-mobile-phone
J,Hayton,21 Crowley Gdns,Somerville,WA,6430,,,,0448 107 607,,jhaz185yton@hotmail.au,61.112.185.101,www.win-free-stuff.com.au/
J,Hayton,6 Cessna Dr,Jandakot,WA,6164,,,,0433 642 546,,jhaa128yton@hotmail.co.au,101.164.128.185,www.mobilephones.com/free-mobile-phones
G,Hayward,40 Seinor St,Somerville,WA,6430,08 9021 3878,,,0419 951 391,,ghaf122yward@live.au,139.20.122.21,www.sureslim.com.au
T,Hayward,8 Jenkins St,Coolgardie,WA,6429,08 9026 7616,,,0400 551 066,,thai171yward@tassie.net.au,192.73.171.158,http://iphoned.org/
J,Hayward,126 Dunedin St,Mt Hawthorn,WA,6016,08 9201 2919,,,0418 108 383,,jhar59yward@hotmail.co.au,138.184.59.88,http://www.engadget.com/2014/03/11/engadget-giveaway-win-an-iphone-5s/
S,Hayward,,,WA,,08 9271 3177,08 9371 1901,,0418 902 715,,shae115yward@gmail.com,138.224.115.142,www.kogan.com/au/competition
P,Hayward,4 Elphin Cl,Kingsley,WA,6026,08 9309 4235,,,0408 094 235,,phaz66yward@yahoo.com,61.115.66.196,www.jennycraig.com.au
F,Hayward,17 Sanders Loop,Kardinya,WA,6163,08 9331 2003,,,0418 904 792,,fhaf216yward@hotmail.co.au,139.234.216.232,http://iphoned.org/
R,Hayward,16 Connell Ave,Martin,WA,6110,08 9490 1457,,,0417 907 898,,rhap185yward@live.au,120.112.185.205,www.competitions.com.au/win-an-iphone-5/3006
L,Hayward,322 Lancaster Rd,McKail,WA,6330,08 9841 2502,,,0417 976 790,,lham100yward@live.au,61.88.100.148,bodyandsoul.com.au?
A,Hayward,2 Trafalgar Rd,Parkfield,WA,6233,,,,0418 947 524,,ahay255yward@bigpond.net.au,60.77.255.23,http://www.engadget.com/2014/03/11/engadget-giveaway-win-an-iphone-5s/
A,Hayward,169 Forrest St,Kalgoorlie,WA,6430,,,,0418 484 895,,ahaz125yward@ektra.ac.th,61.234.125.246,http://www.engadget.com/2014/03/11/engadget-giveaway-win-an-iphone-5s/
A,Hayward,8 A Ramsden Ave,East Victoria Park,WA,6101,,,,0433 540 391,,ahaa76yward@tassie.net.au,101.30.76.20,http://www.engadget.com/2014/03/11/engadget-giveaway-win-an-iphone-5s/
A,Hayward,2 Truslove Cl,Willagee,WA,6156,,,,0438 953 004,,ahab174yward@gmail.com,110.203.174.165,http://www.engadget.com/2014/03/11/engadget-giveaway-win-an-iphone-5s/
C,Hayward,24 Bogle Way,Spalding,WA,6530,,,,0408 970 799,,chac100yward@gmail.com,120.142.100.117,http://www.engadget.com/2014/03/11/engadget-giveaway-win-an-iphone-5s/
D,Hayward,4 Massingham St,Kellerberrin,WA,6410,,,,0413 897 471,,dhad172yward@yahoo.com,121.15.172.120,http://www.engadget.com/2014/03/11/engadget-giveaway-win-an-iphone-5s/
D,Hayward,41 Ravenscroft Way,Westfield,WA,6111,,,,0400 204 179,,dhae102yward@hotmail.com,138.23.102.227,http://www.engadget.com/2014/03/11/engadget-giveaway-win-an-iphone-5s/
D,Hayward,23 Leichhardt Crsg,Hammond Park,WA,6164,,,,0418 940 025,,dhaf79yward@live.au,139.108.79.254,http://www.engadget.com/2014/03/11/engadget-giveaway-win-an-iphone-5s/
E,Hayward,9 Nooyan Cl,South Guildford,WA,6055,,,,0400 501 096,,ehag3yward@live.au,143.90.3.87,http://www.engadget.com/2014/03/11/engadget-giveaway-win-an-iphone-5s/
G,Hayward,2 Trafalgar Rse,Australind,WA,6233,,,,0400 730 954,,ghah96yward@live.au,165.93.96.61,http://www.engadget.com/2014/03/11/engadget-giveaway-win-an-iphone-5s/
G,Hayward,30 Foy St,Esperance,WA,6450,,,,0400 265 711,,ghai128yward@yahoo.com,192.13.128.171,http://www.engadget.com/2014/03/11/engadget-giveaway-win-an-iphone-5s/
H,Hayward,16 Highrclaire Bvd,Marangaroo,WA,6064,,,,0437 844 917,,hhaj6yward@hotmail.co.au,203.48.6.58,http://www.win-free-stuff.com.au/
H,Hayward,30 Hovea Cres,Wundowie,WA,6560,,,,0428 517 062,,hhak28yward@gmail.com,58.14.28.95,http://www.win-free-stuff.com.au/
J,Hayward,1 Adrian Ct,Leeming,WA,6149,,,,0419 339 827,,jhal13yward@hotmail.au,60.27.13.203,http://www.win-free-stuff.com.au/
J,Hayward,61 Kurrajong St,Kununurra,WA,6743,,,,0438 611 337,,jham172yward@hotmail.co.au,61.36.172.180,www.kogan.com/au/competition
K,Hayward,1 Conliffe Pl,Boulder,WA,6432,,,,0438 471 575,,khan31yward@yahoo.com,211.84.31.99,www.kogan.com/au/competition
L,Hayward,100 Adam St,Katanning,WA,6317,,,,0439 962 991,,lhao149yward@hotmail.com,110.165.149.198,www.kogan.com/au/competition
L,Hayward,17 North Banff Rd,Floreat,WA,6014,,,,0438 080 511,,lhap134yward@gmail.com,120.13.134.217,www.winiphone5.com.au
N,Hayward,24 Swallow Loop,High Wycombe,WA,6057,,,,0428 144 318,,nhaq244yward@msn.com,121.112.244.30,www.winiphone5.com.au
P,Hayward,11 Wakayama Cres,Cable Beach,WA,6726,,,,0429 408 267,,phar44yward@live.au,138.204.44.97,www.winiphone5.com.au
Q,Hayward,2 The Dll,Thornlie,WA,6108,,,,0428 198 976,,qhas98yward@bigpond.net.au,139.108.98.172,www.winnow.com.au
R,Hayward,2 Colllin Rd,Scarborough,WA,6019,,,,0439 913 546,,rhat208yward@ektra.ac.th,143.39.208.234,www.winnow.com.au
S,Hayward,52 Duke St,Scarborough,WA,6019,,,,0433 706 336,,shau253yward@tassie.net.au,165.39.253.220,www.winnow.com.au
W,Hayward,29 Sholl St,Roebourne,WA,6718,,,,0428 757 276,,whav253yward@gmail.com,192.240.253.238,http://www.competitioncrazy.com/au/prize/free-iphone/
I,Haywood,,Booragoon,WA,6154,08 9330 6962,,,0402 084 676,,ihao_ywood@tassie.net.au,110.117.107.28,http://iphoned.org/
J,Haywood,28 Bellavista Pde,Meadow Springs,WA,6210,08 9581 7400,,,0407 821 856,,jhaz101ywood@live.au,61.134.101.162,www.freewego.com/iphone4s/?
