full_name,ic,dob,gender,gender_name,race,race_name,occupation,mobile_no,email,salary,blood_type,blood_type_name,address,city,state,postal,medical_history,allergy,emergency_contact_name1,emergency_contact_no1,emergency_contact_name2,emergency_contact_no2,contribution,employer_code,business_name,src
NUR SHARFATIN BINTI CHE ABDULLAH,9.30713E+11,13-07-1993,2,F,1,melayu,,60102014641,,2000,0,,19-5-11 Teratai mewah apartment jalan langkawi setapak 53000 wilayah persekutuan,,,,ASTHMA,NO,HASMALIZA AZLINI,179629631,RAJA AMMAR ASYRAF,102014557,43.9,A3101020993M,RS EVENT KL SDN. BHD.,res_employees_1
HO SHEI YI,8.70722E+11,21-07-1987,2,F,2,cina,,60102039078,,1600,1,O+,"D1-206, Persiaran Pandan Jaya, Cheras, 55100 Kuala Lumpur",,,,,,HO SHEI MUN,123711776,,,34.9,A3700080272X,JHH TRADING SDN. BHD.,res_employees_1
THENNARASI A/P PACKIRISAMY,8.61006E+11,06-10-1986,2,F,3,india,,60102042006,,1200,2,O-,"No. 17, Dataran Tasek Timur 6, Taman Mujur Bercham, 31400 Ipoh Perak",,,,Baik,Tiada,Packirisamy Veerasamy,194363534,Chandrasehgari Kundumony,55477386,25.9,D4100023616W,"SHEAN-LOW, NOOR & TAN",res_employees_1
LOW SIEW KEE,6.30826E+11,26-08-1963,2,F,2,cina,,60102058093,,5450,5,B+,"10, Jalan 2/154A, Taman Delima, Cheras",,,,,,Mok Chee Thong,126139732,Mok Chun Wai,172689721,88.8,A3700033011X,OPTIMUM CONSULTING ENGINEERS,res_employees_1
NG SHENG YIK,710100701,10-07-2000,1,M,2,cina,,60102060241,,1200,0,,"NO .134 SITE C , LORONG 3 ,45400 , SEKINCHAN SELANGOR",,,,,,CHIA SOON SHIN,016-6081664,,,28.1,B3301000778M,MK   COMMERCIAL  SDN  BHD,res_employees_1
KALAI VANI A/P SUPPIAH,9.01109E+11,09-11-1990,2,F,3,india,,60102068016,,1500,0,,"No 2049,Jln SJ 10/10,Taman Seremban Jaya,Seremban,70450 Negeri Sembilan",,,,,,Suppiah Muthu,176758166,Paramiswary Raman,176935838,39.4,E2100024071V,FESYEN LADYLAND,res_employees_1
PREMALATHA A/P GANESAN,9.11113E+11,13-11-1991,2,F,3,india,,60102069514,,1350,1,O+,"NO 15 JALAN SG DAUN 1C, TAMAN SRI MUTIARA, BATU 4 JALAN KAPAR 42100 KLANG",,,,SIHAT,TIADA,GANESAN,162781721,JANAKI,163035242,30.4,B3400039989Z,TADIKA IKHLAS RIA,res_employees_1
MOHD FAIRUZ HANIZA BIN NORAZMAN,8.80906E+11,06-09-1988,1,M,1,melayu,,60102070692,,1200,5,B+,"NO B4-4,JALAN PPM RUMAH PANGSA PANDAN MALIM 75250 MELAKA.",,,,,,SITI REMLAH,136254122,LIZANA,1126266173,28.1,E2300028992W,SOON JAYA TAYAR & SERVIS SDN BHD,res_employees_1
LEONG PUI SAN,9.70925E+11,25-09-1997,2,F,2,cina,,60102072368,,5,0,,"F3-02-11, Good Year Court 6, USJ 8, 47610 Subang Jaya, Selangor",,,,,,Thum Foong Mee,193307507,Berry's Cake House Sdn Bhd,356339688,19.1,B3200016019Y,BERRY'S CAKE HOUSE SDN. BHD.,res_employees_1
RONALD TAY JIA WEI,9.01229E+11,29-12-1990,1,M,2,cina,,60102096603,,2500,0,,"No: 20A, Jalan Damai Perdana 9/2H, Bandar Damai Perdana, 56000 Kuala Lumpur.",,,,,,Cheah Siew Ping,010-3371427,,,,A3100049901Y,CSTRADE MARKETING (M) SDN BHD,res_employees_1
PRIYA A/P SELADURAI,8.70703E+11,03-07-1987,2,F,3,india,,60102101737,,1000,0,,"NO.464, JALAN MELATI 1,TAMAN DUSUN SETIA 70100 SEREMBAN N.S.",,,,,,LOUIS SAMUELS,176067636,,,25.9,E2101003656A,SOON JAYA TAYAR CENTER,res_employees_1
EE CHOON HUAT,8.20824E+11,24-08-1982,1,M,2,cina,,60102104333,,3000,0,,,,,,,,EE ENG SUM,016-7612311,,,73.1,E1100064439W,TKS AIRCOND & ELECTRICAL SERVICES,res_employees_1
DIKTY ISKANDARIAH BINTI ABI YASIR,9.30604E+11,04-06-1993,2,F,1,melayu,,60102105340,,920,0,,"KAMPUNG GARUDA BARU, JLN TANDEK, KOTA MARUDU, SABAH",,,,,,MUNIRAH,163935067,,,21.4,F9600026729M,JJ SWEET CORN SDN. BHD.,res_employees_1
MUHAMMAD AZHAR BIN ZAKARIAH,9.5101E+11,10-10-1995,1,M,1,melayu,,60102111383,,1541.1,0,,BATU 2 1/2 SOLOK SARANG LANG BACHANG 75350 MELAKA,,,,,,ZAKARIAH BINTI ABU HASAN,6063361352,ZAKARIAH BINTI ABU HASAN,60104240389,7.9,E2301001749Z,SEKI AOI TECHNO (MALAYSIA) SDN BHD,res_employees_1
YAP KWOK FOO,8.50406E+11,06-04-1985,1,M,2,cina,,60102119971,,1700,0,,"143, JALAN SERI TIMAH 1/11,TAMAN SERI TIMAH,43300 SERI KEMBANGAN SELANGOR",,,,,,RAJA,162377644,,,43.9,B3900007209B,DIGITAL PLATE (M) SDN BHD,res_employees_1
LIM WAI TENG,9.40119E+11,19-01-1994,2,F,2,cina,,60102140738,,1000,7,AB+,"63 JALAN 6/155A, BUKIT JALIL 57000 KUALA LUMPUR",,,,TIADA,TITADA,KM TAN,60126636830,CC LIM,60122169223,21.4,A3102003275W,LITA LIM HOLDINGS SDN BHD,res_employees_1
ROSNAHDIAH BINTI ROSLAN,9.00521E+11,21-05-1990,2,F,1,melayu,,60102144858,,1000,3,A+,SEGAMAT,,,,,,SARIFAH BINTI SALLEH,1117776515,,,0,E1400007430M,AZA IM ENTERPRISE SDN BHD,res_employees_1
CHEE TENG HO,9.30718E+11,18-07-1993,1,M,2,cina,,60102147574,,2800,0,,"618B, Lorong 23, Jalan Low Hee Kong, Ujong Pasir, 75050, Melaka.",,,,,,Tee Beng Choo,126683283,,,61.9,B3200074739P,ENFRASYS CONSULTING SDN BHD,res_employees_1
YUNIS BIN ANSAKIT,7.40407E+11,07-04-1974,1,M,4,bumiputera_sabah,,60102150396,,1900,5,B+,kg kemabong,,,,tiada,tiada,milah alip,102879603,CERLEFEE,168852774,43.9,F9600027546F,BUMI AKTIF SDN. BHD.,res_employees_1
WAN MUHAMMAD KHALIS BIN WAN HUSSIN,8.61114E+11,14-11-1986,1,M,1,melayu,,60102152310,,1547.07,0,,DT 3491 JALAN BELATUK EMAS 3 TAMAN BELATUK EMAS 76100 DURIAN TUNGGAL MELAKA,,,,,,NUR ASYIKIN,60102153020,,,46.1,E2301001749Z,SEKI AOI TECHNO (MALAYSIA) SDN BHD,res_employees_1
LAI TING FUNG,9.71129E+11,28-11-1997,1,M,2,cina,,60102171608,,1500,0,,,,,,,,KWAN SOOK WAI,102208323,,,32.6,B3901004978Y,C TWO GADGET SDN. BHD.,res_employees_1
CHAN KOK YOONG,6.50619E+11,19-06-1965,1,M,2,cina,,60102174573,,1700,0,,"E1-01 Block E, Taman Satia, 43300 Seri Kembangan, Selangor",,,,,,CHAN KOK KUEN,546533360,,,39.4,A3100036877F,AMAN SATU MANAGEMENT CORPORATION,res_employees_1
LOW HUN SEANG,8.81201E+11,01-12-1988,1,M,2,cina,,60102178262,881201355223@yopmail.com,4000,5,B+,,,,,,,12,4906809,,,88.8,C5101004972B,ROADTAG TECHNOLOGY SDN.  BHD.,res_employees_1 tb0 join result_02 tb1
CHUA PEI LING,9.31016E+11,16-10-1993,2,F,2,cina,,60102199253,931016105890@yopmail.com,1725,0,,,,,,,,CHUA WEI CHOON,1126332887,,,66.4,B3401000371A,UT PASTRY SDN BHD,res_employees_1 tb0 join result_02 tb1
ONG SU YEN,8.2122E+11,20-12-1982,2,F,2,cina,,60102203451,,3300,3,A+,"12-06 iZen Kiara 1, Jalan Kiara, Mont Kiara, 50480 Kuala Lumpur",,,,,,Ong Chong Gene,60142678990,,,79.9,A3100045968F,PIPAL FINE ART,res_employees_1
LAU SUK TENG,9.40111E+11,11-01-1994,2,F,2,cina,,60102205668,,2300,5,B+,"419, JALAN MERAK 15, TAMAN THIVY JAYA, SEREMBAN, 70100 NEGERI SEMBILAN, MALAYSIA.",,,,,ANTI BACTERIA,LAU BOON GUAN,60164420491,LAU BOON HONG,60166680491,23.6,A3101011814K,GLOBAL DISPLAY SDN. BHD.,res_employees_1
LOW SIEW HUI,8.80405E+11,05-04-1988,1,M,2,cina,,60102208465,,5200,1,O+,"NO.2 JALAN PUTERI 8/7, BANDAR PUTERI PUCHONG, 47100 PUCHONG, SELANGOR",,,,G6PD,BROAO BEAN,TAN YIT LEE,012-6394858,LOW GEE LEONG,019-3347347,88.8,A3600005252F,COSCHEM SDN BHD,res_employees_1
SAM KAM YORK,7.30423E+11,23-04-1973,2,F,2,cina,,60102210730,,1200,1,O+,"170N JALAN LAKSAMANA 15, TAMAN KOTA LAKSAMANA, 75200 MELAKA.",,,,,,Sam wah Seng,62840023,,,25.9,E2301004025B,JIA JIA AGENCY,res_employees_1
KANG SAN SIEW,9.20624E+11,24-06-1992,2,F,2,cina,,60102218832,,2600,0,,6 JALAN SUNGAI RAMAL 32/55C BUKIT RIMAU 40460 SHAH ALAM SELANGOR,,,,,,KANG MOOI CHIN,123805199,STEVE YONG,123791108,57.4,B3401005461M,ONCODE SCIENTIFIC SDN BHD,res_employees_1
CHEE KAI LIDD,7.01112E+11,12-11-1970,1,M,2,cina,,60102218996,,3450,3,A+,"5-9-9 PEARL TOWER SERI MAS CONDOMINIUM, JALAN 4/89A CHERAS 56000 KUALA LUMPUR",,,,TIADA,SULFER/BACTNUM,1133020288,379846200,379846201,,77.6,A3700047321P,MICROSOLVE (M) SDN BHD,res_employees_1
KANAGESWARI A/P DEVADASS,7.90108E+11,08-01-1979,2,F,3,india,,60102221793,,3300,7,AB+,"21,JALAN BUKIT EMAS 3,TAMAN BUKIT EMAS,SERI KEMBANGAN,43300 SELANGOR.",,,,,,STEPHEN,1136679376,ANITHA,102404402,88.8,A3100007588P,THAM CHEE PLASTIC INDUSTRY SDN. BHD.,res_employees_1
EMPLOYEE 1,1.11111E+11,31-07-1979,2,F,1,melayu,,60102222222,,89399,1,O+,"281, Jalan Ampang, 50538 Kuala Lumpur",,,,Tiada,,Contact 1 Name,60102222333,Contact 2 Name,60102222555,,E1100029762A,INTRA HOME MANUFACTURING SDN BHD,res_employees_1
NITHTIA PERIASAMMAY,8.40516E+11,16-05-1984,2,F,3,india,,60102250516,840516146118@yopmail.com,3200,1,O+,"Lot 1501-A Jalan keretapi Lama,Batu 11, 42200 Kapar, Selangor",,,,NO,NO,Endiran,102250516,Prasath,146441765,70.9,B3200081234P,CONCEPTRIAL SDN BHD,res_employees_1 tb0 join result_02 tb1
SIA YUK KIONG,6.30624E+11,24-06-1963,1,M,2,cina,,60102252439,630624135357@yopmail.com,3200,0,,"NO. 2B, LORONG DESHON 18C, SIBU, SARAWAK, MALAYSIA",,,,,,SIA CHEW HO,178122269,SIA CHEW PENG,165255256,70.9,F8700015743Z,KIONG SING HARDWARE & INDUSTRIAL SB,res_employees_1 tb0 join result_02 tb1
MOHD RUSNI BIN TAMBI ALI,6.60716E+11,16-07-1966,1,M,1,melayu,,60102253819,,1040,0,,MT 2132 LORONG 31 TAMAN SRI AMAN 78300 MASJID TANAH MELAKA,,,,,,AFAZIA,60129610195,,,14.6,E2300027058A,YAN HONG HARDWARE TRADING SDN BHD,res_employees_1
MOHAMAD IDHAM BIN SAMAD,9.6013E+11,30-01-1996,1,M,1,melayu,,60102255355,,1400,1,O+,"No. 3-10A, Jlan SP 5/3, Seksyen 5, Taman Serdang Perdana, 43300 Seri Kembangan, Selangor",,,,,,Samad Bin Moon,60185784852,Aisar Bin Zaim,60133552074,30.4,A3702009883K,BINTANG HARAPAN SOLUTIONS,res_employees_1
TAN SHU WEN,8.90325E+11,25-03-1989,2,F,2,cina,,60102256256,,3100,3,A+,"20, jalan cheras permai 4, taman cheras permai, 43200 batu 9 cheras, selangor",,,,,,tan tooi seng,60126565119,tew yok sim,60176633266,68.6,A3700051126Y,MARMORA MMR (M) SDN. BHD.,res_employees_1
BONG YEE THING,8.80517E+11,17-05-1988,2,F,2,cina,,60102259517,,3500,3,A+,"69, Kelang Lama, 09000 Kulim, Kedah",,,,,,Bong Yee Fen,174792092,,,25.9,A3101004585K,DNA PHARMA (M) SDN. BHD.,res_employees_1
KOK WEI PING,8.9022E+11,20-02-1989,2,F,2,cina,,60102261751,890220146122@yopmail.com,2800,0,,"No 31, Jalan St Thomas Taman Kaya, Batu 3 1/2 Off Jalan Ipoh, 51100 Kuala Lumpur",,,,,,Kok Wei Ying,60122569819,,,61.9,A3101022396K,SCAPE CONSOLIDATE BERHAD,res_employees_1 tb0 join result_02 tb1
TING JIAN HANG,9.31102E+11,02-11-1993,1,M,2,cina,,60102264823,,2500,0,,"3, JALAN KANTAN 10/KS6, BANDAR BOTANIC, 41200 KLANG, SELANGOR DARUL EHSAN",,,,,,HO YUEN FONG,122975838,TING SEE THO,122368165,55.1,B3401008656A,FLUSSOMAX ENTERPRISE,res_employees_1
TAN CHUAN KEONG,7.71119E+11,19-11-1977,1,M,2,cina,,60102266218,771119105471@yopmail.com,2500,0,,"LOT 510, BATU 18 1/2, KAMPUNG SUNGAI MANGGIS, 42700 BANTING, SELANGOR DARUL EHSAN.",,,,,,TAN CHWEE LEE,102266991,TAN CHWEE CHOO,122268802,55.1,B3400030833W,TAN YAAN REALTY SDN. BHD.,res_employees_1 tb0 join result_02 tb1
IRENE SOH SZE LING,9.30803E+11,03-08-1993,2,F,2,cina,,60102266376,930803106206@yopmail.com,4300,5,B+,"NO 25, LORONG SERI , SEMENTARA 1 TAMAN SERI SEMENTARA 42100 KLANG",,,,,,PUAH BOON YEE,102266276,TAN LAEE CHOO,162966822,88.8,B3400021871A,B-VER CONSTRUCTION SDN BHD,res_employees_1 tb0 join result_02 tb1
JEAN MARIE TONNY ABRAHAM,9.11029E+11,29-10-1991,2,F,3,india,,60102280391,,1800,1,O+,"NO 10, JALAN MAWAR 25, TAMAN MAWAR, 81700, PASIR GUDANG, JOHOR",,,,TIADA,TIADA,AMERYBELL MIRANDAH,143152354,TONNY ABRAHAM,197127430,32.6,E1101005503K,PRO CARE PHYSIO SDN BHD,res_employees_1
CHONG SOONG TEE,9.61023E+11,23-10-1996,2,F,2,cina,,60102280455,961023105968@yopmail.com,2600,0,,"NO PT 2, JALAN POLIS DRIVE, JALAN SK 1/1, 43300 SERI KEMBANGAN, SELANGOR",,,,,,CHONG HON THONG ,60123920455,,,61.9,B3900007614X,TATSUNO ENGINEERING&SERVICE MALAYSIA SB,res_employees_1 tb0 join result_02 tb1
LOH HENG LAM,9.60131E+11,31-01-1996,2,F,2,cina,,60102282739,,2850,1,O+,"D-10-17 IMPIAN BAIDURI 6, JALAN 224 SEK 51A, 46100 PETALING JAYA, SELANGOR.",,,,,,Tan Lay Joo,163540801,Loh Chee Yuen,102399864,64.1,B3200087122F,SENTERIOR DESIGN SDN BHD,res_employees_1
NADIA BINTI AHMAD IZANI,9.20314E+11,14-03-1992,2,F,1,melayu,,60102297750,,900,0,,,,,,,ASMA,AIDA SUZANA,139804054,,,19.1,F9101001856Y,NOURBEALLE SPA,res_employees_1
NUR SHAZLIANA BINTI CUDDING,10601121086,01-06-2001,2,F,1,melayu,,60102306357,,1000,0,,04-02 BLOK A FLAT AKASIA JALAN PERSIARAN CEMERLANG TAMAN DESA CEMERLANG 81800 ULU TIRAM JOHOR,,,,,,BUNGA MAWAR BINTI EBEH,198300643,,,7.9,E1100049679K,MAJMAL,res_employees_1
YEO KHAI WEN ,9.51023E+11,23-10-1995,2,F,2,cina,,60102310213,951023065346@yopmail.com,2000,0,,"NO.14, LORONG K.S 18, TAMAN KUANTAN JAYA 25200 KUANTAN PAHANG",,,,,,SHIH KAH WEY,102250213,,,43.9,F7401003018M,PROASIA MARKETING (M) SDN BHD,res_employees_1 tb0 join result_02 tb1
LEE PEY JIN,8.90412E+11,11-04-1989,2,F,2,cina,,60102310411,,2100,0,,"NO. 111, JALAN S2 H4, PARK AVENUE, 70300 SEREMBAN",,,,,,JACK LEE ,169966702,Chan Yuen Fong,123073533,39.4,E2100017883V,NORTH ELEGANCE PROPERTY SDN. BHD.,res_employees_1
CHUA MING CHU,8.70419E+11,19-04-1987,2,F,2,cina,,60102311513,870419465050@yopmail.com,2500,1,O+,"5CL, PANGSAPURI IBAI RIA, KG TOK ADIS",,,,,,RICKY WONG,179843328,,,70.9,F8201001260P,PEGASUS CHILD EDUCARE SDN. BHD.,res_employees_1 tb0 join result_02 tb1
KOSHILAA A/P ARNASALAM,9.10518E+11,18-05-1991,2,F,3,india,,60102311741,,2000,0,,"NO 2 JALAN JUSA 25, TAMAN MEDAN PEJASA 46000 PETALING JAYA SELANGOR.",,,,,,SUGUMARAN A/L MUNIANDY,183131171,ARNASALAM A/L KUPPAN,123731741,43.9,B3201002817W,SURIA MAJU LOGISTIK SDN BHD,res_employees_1
WEE KAH PENG,9.60306E+11,05-03-1996,1,M,2,cina,,60102311946,960305565693@yopmail.com,1500,0,,"D5-12-2 SCOT PINE CONDOMINIUM, BANDAR SUNGAI LONG",,,,,,BOON SAY MOI,182258637,,,32.6,A3702014100F,RED DINO SDN BHD,res_employees_1 tb0 join result_02 tb1
CHUA CHUN SIA,9.10426E+11,26-04-1991,2,F,2,cina,,60102315306,,1800,0,,"109-A, AIR SALAK, 75250 MELAKA",,,,,,YEO YEOK LIN,166658809,,,41.6,E2300009429K,LSPCM (MELAKA) SDN BHD,res_employees_1
KOH WEN YEN,9.2062E+11,20-06-1992,1,M,2,cina,,60102316458,,2300,1,O+,"2, Jalan Bentara 16, Taman Ungku Tun Aminah, 81300 Skudai, Johor",,,,none,none,Koh Yen Joo,167498081,Gan Chew,1031721961,61.9,E1100063762B,BLUE OCEAN DATA SOLUTIONS SDN BHD,res_employees_1
CHOK WEE CHING,8.4022E+11,20-02-1984,1,M,2,cina,,60102318819,,2800,0,,"19 Taman Lukut, 71010 Lukut, Negeri Sembilan",,,,,,Chok Chun Keong,126317991,Chok Wee Yee,65 97831065,88.8,E2100026284K,SOLAR SKYWORKS SDN.BHD.,res_employees_1
WONG KIM YOONG,9.30619E+11,19-06-1993,1,M,2,cina,,60102318892,930619105473@yopmail.com,2500,0,,"B-15-02, THE HERON RESIDENCY, PERSIARAN BUKIT PUCHONG, BANDAR BUKIT PUCHONG, 47120 PUCHONG SELANGOR.",,,,,,Jimmy Wong,60143176686,WENNIE CHEAH,60123892628,55.1,A3702014100F,RED DINO SDN BHD,res_employees_1 tb0 join result_02 tb1
NAGENDRAN A/L RAJANDRAN,8.91012E+11,12-10-1989,1,M,3,india,,60102320069,,2800,0,,"A-2-9, Apartment Vista Bayu, Taman Bayu Perdana, 41200 Klang, Selangor",,,,,,Rajandran,192492188,,,68.6,A3700081573Z,MICRO OCEAN TECHNOLOGIES SDN. BHD.,res_employees_1
CHONG CHOOI FONG,8.10818E+11,18-08-1981,2,F,2,cina,,60102322730,810818145500@yopmail.com,8500,1,O+,15-10-8 Danau Impian Condominium Jalan 3/109F Taman Danau Desa 58100 Kuala Lumpur,,,,,,DANNY LEE,60196690199,HO KOK HONG,60122130196,88.8,B3201008417Y,COMMSIGHTS MALAYSIA SDN BHD,res_employees_1 tb0 join result_02 tb1
CHIN KOK CHEONG,8.30719E+11,19-07-1983,1,M,2,cina,,60102323101,,4000,0,,,,,,,,Chan Wei Shan,60102323100,,,88.8,B3900006890V,TRADEXIS CORPORATION SDN BHD,res_employees_1
OOI HUI MEI,9.31029E+11,29-10-1993,2,F,2,cina,,60102323908,931029075002@yopmail.com,1800,0,,"NO. 2, LEBUH SUNGAI BURUNG TIGA, 11000 BALIK PULAU, PULAU PINANG",,,,,,OOI SWEE AN,125879840,YEOH SIEW YENG,174071470,39.4,C5100026619B,HEE LEE PONG,res_employees_1 tb0 join result_02 tb1
THUM SIEW ENG,5.40618E+11,18-06-1954,2,F,2,cina,,60102324369,540618075192@yopmail.com,1000,1,O+,"BLOCK 42-13-1, DESA GREEN, JALAN VAN PRAAGH, 11600 PENANG.",,,,NONE,NONE,THUM TEK  HONG,124844661,THUM  TEIK  POEY,164448371,,C5100001863A,CONVENT KINDERGARTEN LEBUH LIGHT,res_employees_1 tb0 join result_02 tb1
ELANGKOVAN A/L SUBRAMANIAM,6.80305E+11,05-03-1968,1,M,3,india,,60102334486,,2800,0,,"F-1-28A, Jalan PJU 10/10F Saujana Damansara PJU 10, 47830 Selangor",,,,,,Ananthi,126408178,,,61.9,A3100048771F,RAYSON LABORATORIES SDN BHD,res_employees_1
NGOI YEE HUI,9.51215E+11,15-12-1995,2,F,2,cina,,60102346778,,1700,5,B+,"BLOK A-1017, JLN PERDANA 9/10, PANDAN PERDANA, 55300 KL",,,,TIADA,TIADA,LOW KIM TIAN,60123916182,NGOI KIM SIM,60163912861,10.1,B3201007435Z,MYP1 COMMERCE SDN. BHD.,res_employees_1
MUHAMMAD ZAFIRUDDIN BIN RIADI ASWIN,9.50223E+11,23-02-1995,1,M,1,melayu,,60102352249,,2000,0,,"LOT 16433,LORONG ONE FUTSAL,KG KEPAS 18500 MACHANG",,,,,,ALIZA HASAN,129533014,RIADI ASWIN BIN RIAK ALI,139223014,52.9,F9100016670Z,RIADI ASWIN BIN RIAK ALI,res_employees_1
JOHARI BIN MAHBOT,5.80814E+11,14-08-1958,1,M,1,melayu,,60102358078,,2428.2,0,,"BATU 9, BUKIT TEMPAYAN, TANGGA BATU, TG. KELING, 76400 MELAKA",,,,,,SHAMSHAH BINTI HAMID,172874809,,,46.1,E2300009429K,LSPCM (MELAKA) SDN BHD,res_employees_1
LIEW HON CHAI,5.7053E+11,30-05-1957,1,M,2,cina,,60102361801,,2400,0,,"NO:49, JALAN 40, SELAYANG BARU, 68100 BATU CAVES, SELANGOR .",,,,,,LIEW TICK SING ,361369808,,,29.4,A3100011709F,GREAT EARTH TRADING SDN. BHD.,res_employees_1
SATHIAMOORTHI A/L MUNIANDY,8.10318E+11,18-03-1981,1,M,3,india,,60102364634,,1717.32,0,,"NO 39 JALAN LAKSAMANA 9 TAMAN DESAWIRA, 42500 TELOK PANGLIMA GARANG KUALA LANGAT ",,,,,,MANIMALA A/P JAYARAMAN MUDALI,60102938434,,,48.4,A3700000605Z,MALAYSIAN PRECISION MANUFACTURING SDN BH,res_employees_1
AZNUR BINTI AZHAR,9.00712E+11,12-07-1990,2,F,1,melayu,,60102395423,,1450,0,,NO 14 JALAN JASA MERDEKA 9 TAMAN DATUK TAMBY CHIK KARIM 75350 BATU BERENDAM MELAKA,,,,,,MOHD IZZUAN B ZAINAL ABIDIN,016-3902776,,,32.6,E2300016853P,LEEBENKO ENTERPRISE SDN. BHD.,res_employees_1
SIOW TUN ZHAN,9.60214E+11,14-02-1996,1,M,2,cina,,60102396829,,1700,0,,"No. 6, Lorong Samarinda 11F, Taman Klang Indah, 41200 Klang, Selangor",,,,,,Siow Teck Lin,127983391,Berry's Cake House Sdn Bhd,356339688,12.4,B3200016019Y,BERRY'S CAKE HOUSE SDN. BHD.,res_employees_1
ROHAYA BINTI MOHD NOR,7.00907E+11,07-09-1970,2,F,1,melayu,,60102397970,,2650,5,B+,"C-1-9, Desa Impiana Condo, Jalan Prima Utama 2, Taman Puchong Prima, 47150 Puchong Selangor",,,,,,Azman Bin Awang,163317970,Mohd Faizuddin Bin Azman,172142305,88.8,A3100031332P,MY-VENTURE PHARMA SDN. BHD.,res_employees_1
SHARIMALA A/P PRAGAS,9.21121E+11,21-11-1992,2,F,3,india,,60102401992,921121105666@yopmail.com,2000,0,,"BLOCK G-4-1 JALAN GAMELAN SRI REBANA BANDAR BUKIT RAJA 41050 KLANG,SELANGOR",,,,,,DINESH,163090316,GOPALAN,192677408,30.4,B3400021404Z,SELATAN MOTOR RECOIL SDN. BHD.,res_employees_1 tb0 join result_02 tb1
UMI NADZIRAH BINTI SHAHMAN,9.41005E+11,05-10-1994,2,F,1,melayu,,60102412502,,1092,0,,NO 87 LORONG CAKERA PURNAMA 12/2 SEKSYEN 12 BANDAR PUNCAK ALAM 45010 K. SEL,,,,,,MOHD SAFUAN BIN OTHMAN,1110188404,YUHANA BT MD JASLIMAN,163204267,23.6,A3700034732K,ADVANCE SCAPES (M) SDN. BHD.,res_employees_1
LAW JHUN WERN,9.40627E+11,27-06-1994,1,M,2,cina,,60102422178,,2128,0,,"No.6, Jalan BS 3/8, Taman Bukit Serdang, Seri Kembangan, 43300 Selangor.",,,,,,Law Soo Chin,60122013221,,,86.6,A3100059778V,CYPRESS MEDIC SDN BHD,res_employees_1
YAP SUNG YEAN,9.40423E+11,23-04-1994,1,M,2,cina,,60102432712,,1610,5,B+,b1-1-2 forest green condominium bandar sungai long ,,,,,,yap swee ming ,126963300,chong chew yan,122349366,39.4,B3900007615V,DEFENDER ENTERPRISE SDN BHD,res_employees_1
THANAKODI A/P BALAKRISHNAN,8.4103E+11,30-10-1984,2,F,3,india,,60102433460,,1100,0,,"NO 12, PTD 174621, JALAN BAYU 319, TAMAN NUSA BAYU, 79200 BANDAR NUSAJAYA, JOHOR.",,,,GOOD,NO,CHANDRAN A/L BALAKRISHNAN,106621705,KANI A/P KAMALNATHAN,102172589,21.4,E1100064659P,VITAMAX FOOD INTERNATIONAL SDN BHD,res_employees_1
RAVEENDRAN A/L KRISHNAN,6.51218E+11,18-12-1965,1,M,3,india,,60102446397,,1400,6,B-,"No.10 Kg Mambau 8.5km , Jalan Port Dickson",,,,,-,Ms.Ananthi,122764317,,,30.4,E2100023611Y,DATMEL TECHNOLOGY SDN BHD,res_employees_1
PUNITHVATHEY A/P MAARIE,8.2121E+11,10-12-1982,2,F,3,india,,60102453505,,1450,0,,NO 59 TAMAN TELUK KEMANG BATU 8 71050 PORT DICKSON NEGERI SEMBILAN,,,,,,THIAGIARAJAN,162439920,,,34.9,E2101001266P,SMART TECH CONSTRUCTION & TRADING,res_employees_1
TEOH HSIAO KHIM,9.3072E+11,20-07-1993,2,F,2,cina,,60102468566,,1500,3,A+,"B188, JLN BATU KAPUR,TMN KOK LIAN, 51200 KL",,,,TAK,TAK,KHOO MARY,122909833,CINDY TEOH,193288328,30.4,B3201003794V,GENESIS SOLUTIONS & TRAINING,res_employees_1
NORASIKIN BINTI ZAKARIA,8.80131E+11,31-01-1988,2,F,1,melayu,,60102468946,880131086210@yopmail.com,1000,5,B+,"KAMPUNG PANGKAL JENEREH,18500,MACHANG KELANTAN",,,,,,NORMA BINTI JUNOH,1135512108,RIADI ASWIN BIN RIAK ALI,139223014,16.9,F9100016670Z,RIADI ASWIN BIN RIAK ALI,res_employees_1 tb0 join result_02 tb1
SURAIDA BINTI ASLAL,8.7071E+11,10-07-1987,2,F,4,bumiputera_sabah,,60102473546,,2500,0,,,,,,,,MONSIANA HJ SABATAR,166457464,NORMA ABDUL WAHID,1117836564,55.1,A3100036160Z,WANGSA HOLDINGS SDN. BHD.,res_employees_1
LAI CHIN THONG,9.10917E+11,17-09-1991,1,M,2,cina,,60102487697,,3000,0,,"No. 34, Lorong Bukit Setongkol 32, Taman Cenderawasih Indah, 25200 Kuantan, Pahang",,,,,,Lee Gaik Kiang,199393791,Lai Yong Chai,139320029,88.8,B3200016019Y,BERRY'S CAKE HOUSE SDN. BHD.,res_employees_1
WEE SIXUN,9.11212E+11,12-12-1991,1,M,2,cina,,60102491408,911212146237@yopmail.com,5500,7,AB+,"25, Jalan Denai Selatan 7 Southlake Terraces Desa Parkcity",,,,IgA Nephropathy,,WEE CHONG KWI,60122983038,,,88.8,B3201005440M,DCM MEDICAL SYSTEM SDN. BHD.,res_employees_1 tb0 join result_02 tb1
GOOI HAO MING,9.5083E+11,30-08-1995,1,M,2,cina,,60102494407,,4624.56,0,,"68, jalan bahagia 20, taman si bahagia, 56000 cheras kl",,,,,,loo mei cheng,123900463,,,88.8,A3100048933Y,SANGFOR TECHNOLOGIES (MALAYSIA) SDN BHD,res_employees_1
CHAANDRRADAVE A/P ARUMUGHAM,8.30225E+11,25-02-1983,2,F,3,india,,60102503105,,1701.85,0,,"NO. 1 JALAN DENDANG 15 TAMAN TELOK, 42500 TELOK PANGLIMA GARANG KUALA LANGAT ",,,,,,KANNAN A/L PERIASAMY,,,,46.1,A3700000605Z,MALAYSIAN PRECISION MANUFACTURING SDN BH,res_employees_1
ELAINE NG,9.01016E+11,16-10-1990,2,F,2,cina,,60102506150,,1800,0,,"A77, Jalan Besar, 36700 Langkap, Perak",,,,,,Lim Yue Keun,125877758,Lim Yue Keun,56591608,39.4,B3201017959Z,PLAY MANAGEMENT SDN BHD,res_employees_1
GUROSHANA A/P MOHANADASAN,8.71224E+11,24-12-1987,2,F,3,india,,60102509628,,1860,1,O+,"No 2, Jalan 1B Selayang Baru, 68100 Batu Caves",,,,-,-,Kishen,60193348730,,,12.4,A3100015921W,NATURAL VISION THERAPY SDN. BHD.,res_employees_1
LEE SIEW KWAN,8.40515E+11,15-05-1984,2,F,2,cina,,60102515340,,1400,3,A+,"NO. 14, JALAN RK 3/5, TAMAN RASAH KEMAYAN, 70300 SEREMBAN, NEGERI SEMBILAN.",,,,,,CHEAH KOK KIEN,60166341312,,,30.4,E2100024719F,THE GIFT TILAPIA RESTAURANT SDN BHD,res_employees_1
YUSRINA BINTI MOHD YUSOF,9.31108E+11,08-11-1993,2,F,1,melayu,,60102530625,,1050,0,,"NO.113, LORONG 56, TAMAN KRUBONG JAYA 75250 MELAKA",,,,,,FATIN NADHIRAH BINTI NAWAWI,1136586577,,,28.1,E2300025258P,PERFECION PRECISION COMPONENT (M) S/B,res_employees_1
ABDUL AZIZ BIN ABDUL RAHMAN,7.51231E+11,31-12-1975,1,M,1,melayu,,60102539003,,900,5,B+,A2-02-02 BLOK 1 PANGSAPURI ANGSANA PERSIARAN SUBANG MEWAH 47620 SUBANG JAYA SELANGOR,,,,,,HALIMAH BT ISMAIL,126948597,,,,B3200087999V,ENTESIS SDN BHD,res_employees_1
NURUL AYURA BINTI AYOB,9.20907E+11,07-09-1992,2,F,1,melayu,,60102547643,,1497,0,,KM 16 KAMPUNG PULAI 77900 MERLIMAU MELAKA,,,,,,KAMISAH BINTI JANTAN ,60129369701,,,57.4,E2301001749Z,SEKI AOI TECHNO (MALAYSIA) SDN BHD,res_employees_1
LOGESWARY A/P ARUMUGAM,9.21014E+11,14-10-1992,2,F,3,india,,60102563134,921014145806@yopmail.com,2700,1,O+,"No.7097, Jln 10, Taman Selayang Baru. 68100 Batu Caves. Selangor",,,,,,Sugen,163341714,Meena,169776954,,A3101014493B,RELTENCY ENGINEERING SERVICES SDN BHD,res_employees_1 tb0 join result_02 tb1
SITI ZARINA BINTI MOHD SAGIR,8.90404E+11,04-04-1989,2,F,1,melayu,,60102576803,,1200,1,O+,NO 8-G-8 APARTMENT NILAI PERDANA 71800 NILAI,,,,,,MAZWANSAFUAN,102576803,MOHD SAGIR,165119179,23.6,E2101001012P,GT GLOBAL TECH SECURITY & AUTOMATION,res_employees_1
YEW HAO YEE,9.80623E+11,22-06-1998,2,F,2,cina,,60102578780,,5,0,,"B-7-20, Jalan Metro Perdana 2, Taman Usahawan, Kepong, 52100 Kuala Lumpur.",,,,,,Yaw Seet Mei,166384568,Berry's Cake House (KL) Sdn Bhd,356339688,5.6,B3200022344M,BERRY'S CAKE HOUSE (KL) SDN. BHD.,res_employees_1